{"text_format":"1","workbook":"xlsx","n_sheets":44,"sheets":["modList00","modHTTP","modPreload","modProvGeneralProc","modReestr","modList02","modfrmReestrSource","Инструкция","Лог обновления","Пояснения","Общие сведения","Список территорий","Список объектов","Баланс","Условные метры","et_union","Амортизация (аналог)","ГО","Расчёт тарифа","TEHSHEET","Комментарии","Проверка","REESTR_OBJECT","DICTIONARIES","modfrmDPR","modfrmSelectTemplate","REESTR_MO","REESTR_ORG","REESTR_TARIFF","modfrmRegion","modfrmSelectTariff","modCheckCyan","modfrmActivity","modfrmCheckUpdates","modProv","modUpdTemplMain","modThisWorkbook","modInstruction","AllSheetsInThisWorkbook","modHyp","modfrmReestr","modList01","modList04","modList06"],"not_rendered":{"charts":0,"images":23,"macros":1,"external_links":0,"defined_names":216,"comments":2,"pivot_tables":0},"unopened":[],"bounds":{"document_bytes":16777216,"sheet_cells":100000,"rows_first":2000,"rows_last":500,"rows_between":2000,"halvings":0,"cell_chars":16384,"cell_head_chars":4096},"cells_cut":0,"cells_raw":0,"read":"whole","date_system":"1900"}

{"sheet":"modList00","index":0,"n_rows":0,"n_cols":0,"rows_kept":0,"cut":false,"hidden":true,"merged":[]}

{"sheet":"modHTTP","index":1,"n_rows":0,"n_cols":0,"rows_kept":0,"cut":false,"hidden":true,"merged":[]}

{"sheet":"modPreload","index":2,"n_rows":0,"n_cols":0,"rows_kept":0,"cut":false,"hidden":true,"merged":[]}

{"sheet":"modProvGeneralProc","index":3,"n_rows":0,"n_cols":0,"rows_kept":0,"cut":false,"hidden":true,"merged":[]}

{"sheet":"modReestr","index":4,"n_rows":0,"n_cols":0,"rows_kept":0,"cut":false,"hidden":true,"merged":[]}

{"sheet":"modList02","index":5,"n_rows":0,"n_cols":0,"rows_kept":0,"cut":false,"hidden":true,"merged":[]}

{"sheet":"modfrmReestrSource","index":6,"n_rows":0,"n_cols":0,"rows_kept":0,"cut":false,"hidden":true,"merged":[]}

{"sheet":"Инструкция","index":7,"n_rows":97,"n_cols":27,"rows_kept":97,"cut":false,"hidden":false,"merged":[[69,4,74,24],[21,5,21,12],[21,15,21,23],[1,1,1,6],[2,1,2,2],[4,1,4,24],[6,4,12,23],[13,4,18,23],[20,5,20,12],[20,15,20,23],[34,4,38,23],[39,4,39,23],[57,4,57,6],[57,7,57,23],[40,4,44,23],[45,4,56,23],[80,4,80,15],[80,16,80,22],[58,4,58,23],[96,5,96,23],[92,4,92,23],[94,5,94,18],[76,4,76,21],[77,4,77,10],[77,11,77,22],[60,7,60,23],[75,4,75,6],[78,4,78,10],[78,11,78,22],[59,4,59,6],[59,7,59,23],[75,7,75,23]]}
[null,null,null,null,null,null,null,null,null,null,null,null,null,null,null,null,null,null,null,null,null,null,null,null,null,null," (требуется обновление)"]
[null,{"$f":"\"Код шаблона: \" & GetCode()","v":"Код шаблона: EXPERT.VSVO.ANALOG"}]
[null,{"$f":"\"Версия \" & Getversion()","v":"Версия 4.2"}]
[]
[null,"Экспертное заключение об установлении тарифов в сфере холодного водоснабжения/водоотведения методом сравнения аналогов"]
[]
[null,null,null,null,"• На рабочем месте должен быть установлен MS Office 2007 SP3, 2010, 2013, 2016, 2019 с полной версией MS Excel\n\n• Макросы во время работы должны быть включены (!)\n\n• Для корректной работы отчёта требуется выбрать низкий уровень безопасности\n(В меню MS Excel 2007 и выше: Параметры Excel | Центр управления безопасностью | Параметры центра управления безопасностью | Параметры макросов | Включить все макросы | ОК)\n\n"]
[]
[]
[]
{"$rows_left_out":88}
{"sheet":"Лог обновления","index":8,"n_rows":7,"n_cols":3,"rows_kept":7,"cut":false,"hidden":true,"merged":[]}
["Дата/Время","Сообщение","Статус"]
[]
["2023-11-30T15:01:53","Проверка доступных обновлений...","Информация"]
["2023-11-30T15:01:55","Нет доступных обновлений для отчёта с кодом EXPERT.VSVO.ANALOG!","Информация"]
["2023-11-30T15:03:41","Проверка доступных обновлений...","Информация"]
["2023-12-01T08:51:13","Проверка доступных обновлений...","Информация"]
["2023-12-01T08:54:30","Проверка доступных обновлений...","Информация"]

{"sheet":"Пояснения","index":9,"n_rows":17,"n_cols":14,"rows_kept":17,"cut":false,"hidden":true,"merged":[]}
[]
[]
[]
[]
[]
[]
[]
[]
[]
[]
{"$rows_left_out":8}
{"sheet":"Общие сведения","index":10,"n_rows":112,"n_cols":15,"rows_kept":112,"cut":false,"hidden":false,"merged":[[89,3,101,3],[84,4,87,5],[103,4,110,5],[61,4,61,6],[63,4,66,5],[68,4,68,7],[69,4,69,7],[111,4,111,6],[7,4,7,6],[78,4,78,7],[79,4,79,7],[80,4,80,7],[81,4,81,7],[83,4,83,7],[72,4,72,7],[73,4,73,7],[74,4,74,7],[75,4,75,7],[76,4,76,7],[77,4,77,7],[88,4,102,5],[70,4,70,7],[71,4,71,7],[47,4,47,6],[48,4,52,4],[48,5,48,6],[49,5,49,6],[50,5,50,6],[51,5,51,6],[52,5,52,6],[54,4,54,6],[55,4,59,4],[55,5,55,6],[56,5,56,6],[57,5,57,6],[58,5,58,6],[59,5,59,6],[14,4,14,7],[20,4,20,6],[21,4,21,6],[16,11,16,12],[17,4,17,7],[18,4,18,6],[19,4,19,6],[15,4,15,7],[16,4,16,7],[6,4,6,6],[10,4,10,7],[11,4,11,7],[12,4,12,7],[13,4,13,7],[46,4,46,6],[31,4,31,6],[32,4,32,6],[33,4,35,5],[36,4,36,6],[37,4,37,6],[44,4,44,6],[38,4,38,6],[40,4,40,6],[43,4,43,6],[41,4,41,6],[42,4,42,6],[27,4,27,6],[28,4,28,6],[29,4,29,6],[30,4,30,6],[22,4,22,6],[23,4,23,6],[24,4,24,6],[25,4,25,6],[26,4,26,6]]}
[]
[]
[]
[]
[]
[]
[null,null,null,null,"Субъект РФ",null,null,"Кемеровская область",{"$f":"INDEX(TEHSHEET!B1:B86,MATCH(region_name,REGION,0))","v":"RU42"}]
[null,null,null,null,"Период регулирования",null,null,2024]
[]
[]
{"$rows_left_out":103}
{"sheet":"Список территорий","index":11,"n_rows":17,"n_cols":17,"rows_kept":17,"cut":false,"hidden":false,"merged":[[11,11,11,16]]}
[null,null,null,null,null,null,null,null,null,null,null,null,"MR_NAME","MO_NAME","OKTMO"]
[]
[]
[]
[]
[]
[]
[]
[]
[]
{"$rows_left_out":8}
{"sheet":"Список объектов","index":12,"n_rows":27,"n_cols":18,"rows_kept":27,"cut":false,"hidden":false,"merged":[[11,11,11,16],[13,11,14,11],[22,11,22,16],[13,12,14,12],[13,13,14,13],[13,16,14,16],[20,14,20,16]]}
[null,null,null,null,null,null,null,null,null,null,null,null,null,null,{"$f":"god","v":2024},{"$f":"god","v":2024},{"$f":"god","v":2024}]
[null,null,null,null,null,null,null,null,null,null,null,null,null,null,"Предложение организации","Принято органом регулирования","Не определено"]
[]
[]
[]
[]
[]
[]
[]
[]
{"$rows_left_out":18}
{"sheet":"Баланс","index":13,"n_rows":42,"n_cols":21,"rows_kept":42,"cut":false,"hidden":false,"merged":[[41,11,41,12],[14,11,15,11],[18,11,19,11],[35,11,35,20],[36,11,36,20],[14,12,15,12],[14,13,15,13],[14,20,15,20],[18,20,19,20],[18,12,19,12],[18,13,19,13],[37,11,37,20],[38,11,38,20],[39,11,39,20],[40,11,40,20]]}
[null,null,null,null,null,null,null,null,null,null,null,null,null,null,{"$f":"god-2","v":2022},{"$f":"god-2","v":2022},{"$f":"god-2","v":2022},{"$f":"god-1","v":2023},{"$f":"god","v":2024},{"$f":"god","v":2024}]
[null,null,null,null,null,null,null,null,null,null,null,null,null,null,{"$f":"O16","v":"Принято органом регулирования"},"Факт по данным организации","Факт, принятый органом регулирования","Принято органом регулирования","Предложение организации","Принято органом регулирования"]
[null,null,null,null,null,null,null,null,null,null,null,null,null,null,{"$f":"O1&O2","v":"2022Принято органом регулирования"},{"$f":"P1&P2","v":"2022Факт по данным организации"},{"$f":"Q1&Q2","v":"2022Факт, принятый органом регулирования"},{"$f":"R1&R2","v":"2023Принято органом регулирования"}]
[]
[]
[]
[]
[]
[]
[]
{"$rows_left_out":33}
{"sheet":"Условные метры","index":14,"n_rows":26,"n_cols":26,"rows_kept":26,"cut":false,"hidden":false,"merged":[[12,11,12,22],[15,20,15,21],[13,17,16,17],[13,18,16,18],[13,20,13,23],[14,20,14,23],[22,11,22,25],[23,11,23,25],[25,11,25,12],[15,22,15,23],[13,19,16,19],[13,25,16,25],[13,11,16,11],[13,12,16,12],[13,13,16,13],[13,14,16,14],[13,15,16,15],[13,16,16,16],[13,24,16,24],[24,11,24,25]]}
[null,null,null,null,null,null,null,null,null,null,null,null,null,null,null,null,null,null,null,null,{"$f":"god","v":2024},null,{"$f":"god","v":2024}]
[]
[]
[null,null,null,null,null,null,null,null,null,null,null,null,"L1","L2","L3","L4","L5","L6","L7","L8","L9_1","L9_2","L9_3","L9_4","L13","L14"]
[]
[]
[]
[]
[]
[]
{"$rows_left_out":17}
{"sheet":"et_union","index":15,"n_rows":204,"n_cols":24,"rows_kept":204,"cut":false,"hidden":true,"merged":[[39,14,39,16],[45,14,45,16],[2,3,14,3],[17,4,21,4],[17,5,17,6],[18,5,18,6],[19,5,19,6],[20,5,20,6],[21,5,21,6]]}
["Титульный"]
["et_List00_tariff"]
[null,null,null,"1",null,null,{"$f":"\"Тариф \" & D3","v":"Тариф 1"},"Водоснабжение","О",{"$f":"G3 & \" (\" &H3& \") - \" &H5 & IF(H9=\"\",\"\",\" (\" & H9 & \")\")","v":"Тариф 1 (Водоснабжение) - "},{"$f":"H8","v":0},{"$f":"H5","v":0},{"$f":"H9","v":0},{"$f":"H6","v":"одноставочный"}]
[null,null,null,null,null,null,"Номер тарифа (идентификатор)"]
[null,null,null,null,null,null,"Вид тарифа"]
[null,null,null,null,null,null,"Тип тарифа","одноставочный"]
[null,null,null,null,null,null,"Вид(-ы) деятельности"]
[null,null,null,null,null,null,{"$f":"IF(H3=\"Водоотведение\",\"Вид сточных вод\",\"Вид воды\")","v":"Вид воды"}]
[null,null,null,null,null,null,"Дополнительный признак дифференциации тарифа"]
[null,{"$f":"org_declaration=\"Заявление организации\"","v":true},null,null,null,null,"Номер входящий"]
{"$rows_left_out":195}
{"sheet":"Амортизация (аналог)","index":16,"n_rows":27,"n_cols":16,"rows_kept":27,"cut":false,"hidden":false,"merged":[[23,11,23,15],[24,11,24,15],[26,11,26,12],[11,11,11,15],[12,11,12,15],[13,11,14,11],[13,12,14,12],[13,13,14,13],[13,14,13,15],[25,11,25,15]]}
[null,null,null,null,null,null,null,null,null,null,null,null,null,null,{"$f":"god","v":2024},{"$f":"god","v":2024}]
[null,null,null,null,null,null,null,null,null,null,null,null,null,null,{"$f":"O15","v":"Предложение организации"},{"$f":"P15","v":"Принято органом регулирования"}]
[]
[]
[]
[]
[]
[]
[]
[]
{"$rows_left_out":18}
{"sheet":"ГО","index":17,"n_rows":92,"n_cols":15,"rows_kept":92,"cut":false,"hidden":false,"merged":[[87,11,87,14],[88,11,88,14],[91,11,91,12],[12,11,12,14],[13,11,14,11],[13,12,14,12],[13,13,14,13],[89,11,89,14],[90,11,90,14]]}
[null,null,null,null,null,null,null,null,null,null,null,null,null,null,{"$f":"god","v":2024}]
[]
[]
[]
[]
[]
[]
[]
[]
[]
{"$rows_left_out":83}
{"sheet":"Расчёт тарифа","index":18,"n_rows":41,"n_cols":16,"rows_kept":41,"cut":false,"hidden":false,"merged":[[37,11,37,15],[38,11,38,15],[40,11,40,12],[35,11,35,15],[11,11,11,15],[12,11,12,15],[13,11,14,11],[13,12,14,12],[13,13,14,13],[13,14,13,15],[39,11,39,15]]}
[null,null,null,null,null,null,null,null,null,null,null,null,null,null,{"$f":"god","v":2024},{"$f":"god","v":2024}]
[null,null,null,null,null,null,null,null,null,null,null,null,null,null,{"$f":"O15","v":"Предложение организации"},{"$f":"P15","v":"Принято органом регулирования"}]
[]
[]
[]
[]
[]
[]
[]
[]
{"$rows_left_out":32}
{"sheet":"TEHSHEET","index":19,"n_rows":175,"n_cols":31,"rows_kept":175,"cut":false,"hidden":true,"merged":[]}
["Алтайский край","RU22","Алтайский край",null,null,null,"YES_NO",null,null,null,null,null,"DNS",null,null,null,"YEAR_LIST","MONTH_LIST","period_list","sphere_list","tariff_type_list","COLDVSNA_VTOV","COLDVSNA_VTARIFF","osn_expl_list","VOLTAGE_LEVEL_list","VOLTAGE_LEVEL2_list","ist_info_build_list","diametr_list","material_list","grunt_list","glubina_list"]
["Амурская область","RU28","Амурская область",null,null,null,"да",null,null,null,null,null,"https://eias.ru",null,null,null,2012,"Январь",3,"Водоснабжение","одноставочный","питьевая вода","тариф на питьевую воду","аренда","Без разбивки","Без разбивки","Утверждённые укрупнённые НЦС","100","чугун","сухой","1"]
["Архангельская область","RU29","Архангельская область",null,null,null,"нет",null,null,null,null,null,null,null,null,null,2013,"Февраль",4,"Водоотведение","двухставочный","техническая вода","тариф на техническую воду","безвозмездное пользование","ВН1","ВН1","Сметные расчёты организации","110","сталь","мокрый","2"]
["Астраханская область","RU30","Астраханская область",null,null,null,null,null,null,null,null,null,"NDS",null,null,null,2014,"Март",5,null,null,"горячая вода",null,"концессионное соглашение","ВН","ВН",null,"125","железобетон",null,"3"]
["Белгородская область","RU31","Белгородская область",null,null,null,"STATE_SHARE",null,null,null,null,null,1.2,null,null,null,2015,"Апрель",6,null,null,null,"VOTV_VTARIFF","оперативное управление","СН1","СН1",null,"150","полиэтилен",null,"4"]
["Брянская область","RU32","Брянская область",null,null,null,"VALUABLE_STATE_SHARE",null,null,null,null,null,null,null,null,null,2016,"Май",7,null,null,"VOTV_VTOV","тариф на водоотведение","собственность","СН2","СН2",null,"160",null,null,"5"]
["Владимирская область","RU33","Владимирская область",null,null,null,"менее 50 %",null,null,null,null,null,"PERIOD",null,null,null,2017,"Июнь",8,null,null,"без дифференциации",null,"хозяйственное ведение","НН","НН",null,"200"]
["Волгоградская область","RU34","Волгоградская область",null,null,null,"50 % и более",null,null,null,null,null,2021,null,null,null,2018,"Июль",9,null,null,"жидкие бытовые отходы",null,"договор хранения",null,"Генерация напряжения",null,"250"]
["Вологодская область","RU35","Вологодская область",null,null,null,"100 %",null,null,null,null,null,null,null,null,null,2019,"Август",10,null,null,"поверхностные сточные воды",null,"договор эксплуатации",null,null,null,"300"]
["Воронежская область","RU36","Воронежская область",null,null,null,null,null,null,null,null,null,"Организация",null,null,null,2020,"Сентябрь",null,null,null,"хозяйственно-бытовые сточные воды",null,"договор обслуживания",null,null,null,"315"]
{"$rows_left_out":166}
{"sheet":"Комментарии","index":20,"n_rows":7,"n_cols":4,"rows_kept":7,"cut":false,"hidden":false,"merged":[]}
[]
[]
[]
[]
[]
[]
[null,null,null,"Комментарии"]

{"sheet":"Проверка","index":21,"n_rows":4,"n_cols":5,"rows_kept":4,"cut":false,"hidden":false,"merged":[[1,1,1,4]]}
[]
[null,"Результат проверки"]
[]
[null,"Ссылка 1","Ссылка 2","Причина","Статус"]

{"sheet":"REESTR_OBJECT","index":22,"n_rows":424,"n_cols":9,"rows_kept":424,"cut":false,"hidden":true,"merged":[]}
["SPHERE","NMBR","NMOB","STYPE","ADDRESS","L_EXPLOIT_DOC_BASE","L_EXPLOIT_DOC_TYPE","L_EXPLOIT_DOC_NUMBER","L_EXPLOIT_DOC_DATE"]
["ВС",null,"Cети водоснабжения","сеть","пгт Верх-Чебула / пгт Верх-Чебула / _","концессионное соглашение","соглашение","2019/ЧМР","13.11.2019"]
["ВС",null,"Артезианская скважина","НС","п 1-й / ул Школьная / 2\"д\"","концессионное соглашение","соглашение","2019/ЧМР","13.11.2019"]
["ВС",null,"Барзасский водозабор НС 2-го подъема [нет]","сеть","г Кемерово / без адреса / б/н","концессионное соглашение","договор","2","28.12.2018"]
["ВС",null,"Барзасский водоподъем долина р. Барзас (в резерве)","НС","г Березовский / г. Березовский / нет","аренда","договор","б/н","20.06.2002"]
["ВС",null,"Буровая водозаборная разведочно-эксплуатационная скважина","НС","п Новоивановский / ул Садовая / 1\"г\"","концессионное соглашение","соглашение","2019/ЧМР","13.11.2019"]
["ВС",null,"ВНС \"Лесная поляна\" [нет]","НС","г Кемерово / автодорога г. Кемерово-Лесная поляна / б/н","концессионное соглашение","договор","2","28.12.2018"]
["ВС",null,"ВОС Поселкового водозабора","ОС","пгт Яя / ул.Юбилейная / 1","аренда","договор","6-11-23","01.08.2023"]
["ВС",null,"Водозабор- насосная станция 1-го подъема","НС","пгт Крапивинский / пгт. Крапивинский / корпус 1","концессионное соглашение","соглашение","1/Л-К","14.11.2019"]
["ВС",null,"Водопроводные сети пгт Яшкино","сеть","пгт Яшкино / - / -","концессионное соглашение","соглашение","№7/ЯМО","28.09.2021"]
{"$rows_left_out":415}
{"sheet":"DICTIONARIES","index":23,"n_rows":96,"n_cols":3,"rows_kept":96,"cut":false,"hidden":true,"merged":[]}
["OPF_VALUE","SUBSIDIARY_LIST","DPR_LIST"]
["1 10 51 | Полные товарищества","Кемеровская ГРЭС"]
["1 10 64 | Товарищества на вере (коммандитные товарищества)","Кемеровская ТЭЦ","1-го водоподъёма г. Новокузнецк"]
["1 22 47 | Публичные акционерные общества","Филиал \"Новосибирский\"","1-го водоподъёма г. Прокопьевск"]
["1 22 67 | Непубличные акционерные общества",null,"Оказание услуг на территории: Беловский муниципальный район (ОКТМО: 32601000) - эксплуатация имущества по договору аренды"]
["1 23 00 | Общества с ограниченной ответственностью",null,"Оказание услуг на территории: Беловский муниципальный район (ОКТМО: 32601000) - эксплуатация имущества по концессионному соглашению"]
["1 30 00 | Хозяйственные партнерства",null,"Оказание услуг на территории: Кемеровский муниципальный округ (ОКТМО: 32507000) - д Сухово, п Металлплощадка"]
["1 41 53 | Сельскохозяйственные артели (колхозы)",null,"Оказание услуг на территории: Крапивинский муниципальный округ (ОКТМО: 32510000) - за исключением пгт Крапивинский, пгт Зеленогорский, с Борисово"]
["1 41 54 | Рыболовецкие артели (колхозы)",null,"Оказание услуг на территории: Крапивинский муниципальный округ (ОКТМО: 32510000) - пгт Крапивинский, пгт Зеленогорский, с Борисово"]
["1 41 55 | Кооперативные хозяйства (коопхозы)",null,"Оказание услуг на территории: Крапивинский муниципальный район (ОКТМО: 32610000)"]
{"$rows_left_out":87}
{"sheet":"modfrmDPR","index":24,"n_rows":0,"n_cols":0,"rows_kept":0,"cut":false,"hidden":true,"merged":[]}

{"sheet":"modfrmSelectTemplate","index":25,"n_rows":0,"n_cols":0,"rows_kept":0,"cut":false,"hidden":true,"merged":[]}

{"sheet":"REESTR_MO","index":26,"n_rows":240,"n_cols":5,"rows_kept":240,"cut":false,"hidden":true,"merged":[]}
["MR_NAME","MO_NAME","OKTMO_NAME","MR_LIST"]
["Беловский муниципальный округ","Беловский муниципальный округ","32501000","Беловский муниципальный округ","MO_LIST_1"]
["Беловский муниципальный район","Беловский муниципальный район","32601000","Беловский муниципальный район","MO_LIST_2"]
["Беловский муниципальный район","Сельское поселение Беловского муниципального района/Бековское","32601402","Гурьевский муниципальный округ","MO_LIST_3"]
["Беловский муниципальный район","Сельское поселение Беловского муниципального района/Евтинское","32601412","Гурьевский муниципальный район","MO_LIST_4"]
["Беловский муниципальный район","Сельское поселение Беловского муниципального района/Менчерепское","32601432","Ижморский муниципальный округ","MO_LIST_5"]
["Беловский муниципальный район","Сельское поселение Беловского муниципального района/Моховское","32601436","Ижморский муниципальный район","MO_LIST_6"]
["Беловский муниципальный район","Сельское поселение Беловского муниципального района/Новобачатское","32601414","Кемеровский муниципальный округ","MO_LIST_7"]
["Беловский муниципальный район","Сельское поселение Беловского муниципального района/Пермяковское","32601444","Кемеровский муниципальный район","MO_LIST_8"]
["Беловский муниципальный район","Сельское поселение Беловского муниципального района/Старобачатское","32601451","Крапивинский муниципальный округ","MO_LIST_9"]
{"$rows_left_out":231}
{"sheet":"REESTR_ORG","index":27,"n_rows":302,"n_cols":10,"rows_kept":302,"cut":false,"hidden":true,"merged":[]}
["№","REGION_ID","REGION_NAME","RST_ORG_ID","ORG_NAME","INN_NAME","KPP_NAME","ORG_START_DATE","ORG_END_DATE"]
[1,"2655","Кемеровская область","26560525","АО \"ГУ ЖКХ\"","5116000922","511601001","13-05-2009 00:00:00",null,"VS"]
[2,"2655","Кемеровская область","30401246","АО \"ГУ ЖКХ\"","5116000922","540645001",null,null,"VS"]
[3,"2655","Кемеровская область","26356953","АО \"ЕВРАЗ ЗСМК\"","4218000951","421801001","30-11-1992 00:00:00",null,"VS"]
[4,"2655","Кемеровская область","28092960","АО \"КФ\" ОСП \"Юргинский ферросплавный завод\"","4216001565","422101001","19-02-2013 00:00:00",null,"VS"]
[5,"2655","Кемеровская область","27804990","АО \"Кемеровская генерация\"","4205243192","420501001","28-04-2012 00:00:00",null,"VS"]
[6,"2655","Кемеровская область","28048296","АО \"Кузбассэнерго\"","4200000333","420501001","30-12-1993 00:00:00",null,"VS"]
[7,"2655","Кемеровская область","27804826","АО \"Кузнецкая ТЭЦ\"","4205243178","420501001","28-04-2012 00:00:00",null,"VS"]
[8,"2655","Кемеровская область","26356963","АО \"ПО Водоканал\"","4223030694","422301001","06-11-2002 00:00:00",null,"VS"]
[9,"2655","Кемеровская область","26322889","АО \"РУСАЛ Новокузнецкий Алюминиевый Завод\"","4221000535","997550001","25-09-2002 00:00:00",null,"VS"]
{"$rows_left_out":293}
{"sheet":"REESTR_TARIFF","index":28,"n_rows":42,"n_cols":11,"rows_kept":42,"cut":false,"hidden":true,"merged":[]}
["TEMPLATE_LGL_ID","TEMPLATE_PRD","TEMPLATE_STATUS","TEMPLATE_DATE","TARIFF_ID","TARIFF_VID","TARIFF_TIP","TARIFF_VDET","TARIFF_VTOV","TARIFF_DOP","TARIFF_MO_LIST"]
[null,null,null,null,"ВО.42.26322895.0001","<нет шаблона>"]
[null,null,null,null,"ВО.42.26322895.0002","<нет шаблона>"]
[null,null,null,null,"ВО.42.26322895.0003","<нет шаблона>"]
[null,null,null,null,"ВО.42.26322895.0004","<нет шаблона>"]
[null,null,null,null,"ВО.42.26322895.0005","<нет шаблона>"]
[null,null,null,null,"ВО.42.26322895.0006","<нет шаблона>"]
[null,null,null,null,"ВО.42.26322895.0007","<нет шаблона>"]
[null,null,null,null,"ВО.42.26322895.0008","<нет шаблона>"]
[null,null,null,null,"ВО.42.26322895.0009","<нет шаблона>"]
{"$rows_left_out":33}
{"sheet":"modfrmRegion","index":29,"n_rows":0,"n_cols":0,"rows_kept":0,"cut":false,"hidden":true,"merged":[]}

{"sheet":"modfrmSelectTariff","index":30,"n_rows":0,"n_cols":0,"rows_kept":0,"cut":false,"hidden":true,"merged":[]}

{"sheet":"modCheckCyan","index":31,"n_rows":30,"n_cols":1,"rows_kept":30,"cut":false,"hidden":true,"merged":[]}
[{"$f":"IF('Общие сведения'!$H$8=\"\",1,0)","v":0}]
[{"$f":"IF('Общие сведения'!$H$26=\"\",1,0)","v":0}]
[{"$f":"IF('Общие сведения'!$H$27=\"\",1,0)","v":0}]
[{"$f":"IF('Общие сведения'!$H$28=\"\",1,0)","v":0}]
[{"$f":"IF('Общие сведения'!$H$29=\"\",1,0)","v":0}]
[{"$f":"IF('Общие сведения'!$H$30=\"\",1,0)","v":0}]
[{"$f":"IF('Общие сведения'!$H$31=\"\",1,0)","v":0}]
[{"$f":"IF('Общие сведения'!$H$32=\"\",1,0)","v":0}]
[{"$f":"IF('Общие сведения'!$H$34=\"\",1,0)","v":0}]
[{"$f":"IF('Общие сведения'!$H$35=\"\",1,0)","v":0}]
{"$rows_left_out":21}
{"sheet":"modfrmActivity","index":32,"n_rows":0,"n_cols":0,"rows_kept":0,"cut":false,"hidden":true,"merged":[]}

{"sheet":"modfrmCheckUpdates","index":33,"n_rows":0,"n_cols":0,"rows_kept":0,"cut":false,"hidden":true,"merged":[]}

{"sheet":"modProv","index":34,"n_rows":0,"n_cols":0,"rows_kept":0,"cut":false,"hidden":true,"merged":[]}

{"sheet":"modUpdTemplMain","index":35,"n_rows":0,"n_cols":0,"rows_kept":0,"cut":false,"hidden":true,"merged":[]}

{"sheet":"modThisWorkbook","index":36,"n_rows":0,"n_cols":0,"rows_kept":0,"cut":false,"hidden":true,"merged":[]}

{"sheet":"modInstruction","index":37,"n_rows":0,"n_cols":0,"rows_kept":0,"cut":false,"hidden":true,"merged":[]}

{"sheet":"AllSheetsInThisWorkbook","index":38,"n_rows":32,"n_cols":2,"rows_kept":32,"cut":false,"hidden":true,"merged":[]}
["Расчетные листы","Скрытые листы"]
["Инструкция","et_union"]
["Лог обновления","TEHSHEET"]
["Пояснения","modProvGeneralProc"]
["Общие сведения","modPreload"]
["Список территорий","REESTR_OBJECT"]
["Список объектов","DICTIONARIES"]
["Баланс","modfrmReestrSource"]
["Условные метры","modfrmDPR"]
["Амортизация (аналог)","modfrmSelectTemplate"]
{"$rows_left_out":23}
{"sheet":"modHyp","index":39,"n_rows":0,"n_cols":0,"rows_kept":0,"cut":false,"hidden":true,"merged":[]}

{"sheet":"modfrmReestr","index":40,"n_rows":0,"n_cols":0,"rows_kept":0,"cut":false,"hidden":true,"merged":[]}

{"sheet":"modList01","index":41,"n_rows":0,"n_cols":0,"rows_kept":0,"cut":false,"hidden":true,"merged":[]}

{"sheet":"modList04","index":42,"n_rows":0,"n_cols":0,"rows_kept":0,"cut":false,"hidden":true,"merged":[]}

{"sheet":"modList06","index":43,"n_rows":0,"n_cols":0,"rows_kept":0,"cut":false,"hidden":true,"merged":[]}